• 0

    posted a message on getting Warning "warning: [options] bootstrap class path not set in conjunction with -source 1.6"

    IDE:IntelliJ
    forge:1.8 - 11.14.4.1563

    i have been trying to add a recipe but i cant test the mod in any way and keep getting the error in the title of the thread:

    warning: [options] bootstrap class path not set in conjunction with -source 1.6


    also i am getting another error:

    CreateProcess error=267


    here is my code & error log

    23:50:38: Executing task 'runClient --stacktrace'...
    
    Etag download for http://files.minecraftforge.net/maven/net/minecraftforge/forge/json failed with code 404
    Error occurred parsing version!
    :deobfCompileDummyTask
    :deobfProvidedDummyTask
    :compileApiJava UP-TO-DATE
    :processApiResources UP-TO-DATE
    :apiClasses UP-TO-DATE
    :sourceMainJava UP-TO-DATE
    warning: [options] bootstrap class path not set in conjunction with -source 1.6
    1 warning
    :compileJava
    :processResources UP-TO-DATE
    :classes
    :jar UP-TO-DATE
    :getVersionJson
    :extractNatives SKIPPED
    :extractUserdev UP-TO-DATE
    :getAssetIndex UP-TO-DATE
    :getAssets
    :makeStart
    [ant:javac] warning: [options] bootstrap class path not set in conjunction with -source 1.6
    [ant:javac] 1 warning
    :runClient FAILED
    
    BUILD FAILED
    
    Total time: 2.378 secs
    
    FAILURE: Build failed with an exception.
    
    * What went wrong:
    Execution failed for task ':runClient'.
    > A problem occurred starting process 'command 'C:\Users\cb\.IdeaIC2019.3\config\jdks\jbsdk8u112b287_windows_x64\bin\java.exe''
    
    * Try:
    Run with --info or --debug option to get more log output.
    
    * Exception is:
    org.gradle.api.tasks.TaskExecutionException: Execution failed for task ':runClient'.
    	at org.gradle.api.internal.tasks.execution.ExecuteActionsTaskExecuter.executeActions(ExecuteActionsTaskExecuter.java:69)
    	at org.gradle.api.internal.tasks.execution.ExecuteActionsTaskExecuter.execute(ExecuteActionsTaskExecuter.java:46)
    	at org.gradle.api.internal.tasks.execution.PostExecutionAnalysisTaskExecuter.execute(PostExecutionAnalysisTaskExecuter.java:35)
    	at org.gradle.api.internal.tasks.execution.SkipUpToDateTaskExecuter.execute(SkipUpToDateTaskExecuter.java:64)
    	at org.gradle.api.internal.tasks.execution.ValidatingTaskExecuter.execute(ValidatingTaskExecuter.java:58)
    	at org.gradle.api.internal.tasks.execution.SkipEmptySourceFilesTaskExecuter.execute(SkipEmptySourceFilesTaskExecuter.java:52)
    	at org.gradle.api.internal.tasks.execution.SkipTaskWithNoActionsExecuter.execute(SkipTaskWithNoActionsExecuter.java:52)
    	at org.gradle.api.internal.tasks.execution.SkipOnlyIfTaskExecuter.execute(SkipOnlyIfTaskExecuter.java:53)
    	at org.gradle.api.internal.tasks.execution.ExecuteAtMostOnceTaskExecuter.execute(ExecuteAtMostOnceTaskExecuter.java:43)
    	at org.gradle.execution.taskgraph.DefaultTaskGraphExecuter$EventFiringTaskWorker.execute(DefaultTaskGraphExecuter.java:203)
    	at org.gradle.execution.taskgraph.DefaultTaskGraphExecuter$EventFiringTaskWorker.execute(DefaultTaskGraphExecuter.java:185)
    	at org.gradle.execution.taskgraph.AbstractTaskPlanExecutor$TaskExecutorWorker.processTask(AbstractTaskPlanExecutor.java:62)
    	at org.gradle.execution.taskgraph.AbstractTaskPlanExecutor$TaskExecutorWorker.run(AbstractTaskPlanExecutor.java:50)
    	at org.gradle.execution.taskgraph.DefaultTaskPlanExecutor.process(DefaultTaskPlanExecutor.java:25)
    	at org.gradle.execution.taskgraph.DefaultTaskGraphExecuter.execute(DefaultTaskGraphExecuter.java:110)
    	at org.gradle.execution.SelectedTaskExecutionAction.execute(SelectedTaskExecutionAction.java:37)
    	at org.gradle.execution.DefaultBuildExecuter.execute(DefaultBuildExecuter.java:37)
    	at org.gradle.execution.DefaultBuildExecuter.access$000(DefaultBuildExecuter.java:23)
    	at org.gradle.execution.DefaultBuildExecuter$1.proceed(DefaultBuildExecuter.java:43)
    	at org.gradle.execution.DryRunBuildExecutionAction.execute(DryRunBuildExecutionAction.java:32)
    	at org.gradle.execution.DefaultBuildExecuter.execute(DefaultBuildExecuter.java:37)
    	at org.gradle.execution.DefaultBuildExecuter.execute(DefaultBuildExecuter.java:30)
    	at org.gradle.initialization.DefaultGradleLauncher$4.run(DefaultGradleLauncher.java:155)
    	at org.gradle.internal.Factories$1.create(Factories.java:22)
    	at org.gradle.internal.progress.DefaultBuildOperationExecutor.run(DefaultBuildOperationExecutor.java:90)
    	at org.gradle.internal.progress.DefaultBuildOperationExecutor.run(DefaultBuildOperationExecutor.java:52)
    	at org.gradle.initialization.DefaultGradleLauncher.doBuildStages(DefaultGradleLauncher.java:152)
    	at org.gradle.initialization.DefaultGradleLauncher.access$200(DefaultGradleLauncher.java:33)
    	at org.gradle.initialization.DefaultGradleLauncher$1.create(DefaultGradleLauncher.java:100)
    	at org.gradle.initialization.DefaultGradleLauncher$1.create(DefaultGradleLauncher.java:94)
    	at org.gradle.internal.progress.DefaultBuildOperationExecutor.run(DefaultBuildOperationExecutor.java:90)
    	at org.gradle.internal.progress.DefaultBuildOperationExecutor.run(DefaultBuildOperationExecutor.java:62)
    	at org.gradle.initialization.DefaultGradleLauncher.doBuild(DefaultGradleLauncher.java:94)
    	at org.gradle.initialization.DefaultGradleLauncher.run(DefaultGradleLauncher.java:83)
    	at org.gradle.launcher.exec.InProcessBuildActionExecuter$DefaultBuildController.run(InProcessBuildActionExecuter.java:94)
    	at org.gradle.tooling.internal.provider.runner.BuildModelActionRunner.run(BuildModelActionRunner.java:46)
    	at org.gradle.launcher.exec.ChainingBuildActionRunner.run(ChainingBuildActionRunner.java:35)
    	at org.gradle.tooling.internal.provider.runner.SubscribableBuildActionRunner.run(SubscribableBuildActionRunner.java:58)
    	at org.gradle.launcher.exec.ChainingBuildActionRunner.run(ChainingBuildActionRunner.java:35)
    	at org.gradle.launcher.exec.InProcessBuildActionExecuter.execute(InProcessBuildActionExecuter.java:43)
    	at org.gradle.launcher.exec.InProcessBuildActionExecuter.execute(InProcessBuildActionExecuter.java:28)
    	at org.gradle.launcher.exec.ContinuousBuildActionExecuter.execute(ContinuousBuildActionExecuter.java:77)
    	at org.gradle.launcher.exec.ContinuousBuildActionExecuter.execute(ContinuousBuildActionExecuter.java:47)
    	at org.gradle.launcher.daemon.server.exec.ExecuteBuild.doBuild(ExecuteBuild.java:52)
    	at org.gradle.launcher.daemon.server.exec.BuildCommandOnly.execute(BuildCommandOnly.java:36)
    	at org.gradle.launcher.daemon.server.api.DaemonCommandExecution.proceed(DaemonCommandExecution.java:120)
    	at org.gradle.launcher.daemon.server.exec.WatchForDisconnection.execute(WatchForDisconnection.java:37)
    	at org.gradle.launcher.daemon.server.api.DaemonCommandExecution.proceed(DaemonCommandExecution.java:120)
    	at org.gradle.launcher.daemon.server.exec.ResetDeprecationLogger.execute(ResetDeprecationLogger.java:26)
    	at org.gradle.launcher.daemon.server.api.DaemonCommandExecution.proceed(DaemonCommandExecution.java:120)
    	at org.gradle.launcher.daemon.server.exec.RequestStopIfSingleUsedDaemon.execute(RequestStopIfSingleUsedDaemon.java:34)
    	at org.gradle.launcher.daemon.server.api.DaemonCommandExecution.proceed(DaemonCommandExecution.java:120)
    	at org.gradle.launcher.daemon.server.exec.ForwardClientInput$2.call(ForwardClientInput.java:74)
    	at org.gradle.launcher.daemon.server.exec.ForwardClientInput$2.call(ForwardClientInput.java:72)
    	at org.gradle.util.Swapper.swap(Swapper.java:38)
    	at org.gradle.launcher.daemon.server.exec.ForwardClientInput.execute(ForwardClientInput.java:72)
    	at org.gradle.launcher.daemon.server.api.DaemonCommandExecution.proceed(DaemonCommandExecution.java:120)
    	at org.gradle.launcher.daemon.server.health.DaemonHealthTracker.execute(DaemonHealthTracker.java:47)
    	at org.gradle.launcher.daemon.server.api.DaemonCommandExecution.proceed(DaemonCommandExecution.java:120)
    	at org.gradle.launcher.daemon.server.exec.LogToClient.doBuild(LogToClient.java:66)
    	at org.gradle.launcher.daemon.server.exec.BuildCommandOnly.execute(BuildCommandOnly.java:36)
    	at org.gradle.launcher.daemon.server.api.DaemonCommandExecution.proceed(DaemonCommandExecution.java:120)
    	at org.gradle.launcher.daemon.server.exec.EstablishBuildEnvironment.doBuild(EstablishBuildEnvironment.java:71)
    	at org.gradle.launcher.daemon.server.exec.BuildCommandOnly.execute(BuildCommandOnly.java:36)
    	at org.gradle.launcher.daemon.server.api.DaemonCommandExecution.proceed(DaemonCommandExecution.java:120)
    	at org.gradle.launcher.daemon.server.health.HintGCAfterBuild.execute(HintGCAfterBuild.java:41)
    	at org.gradle.launcher.daemon.server.api.DaemonCommandExecution.proceed(DaemonCommandExecution.java:120)
    	at org.gradle.launcher.daemon.server.exec.StartBuildOrRespondWithBusy$1.run(StartBuildOrRespondWithBusy.java:50)
    	at org.gradle.launcher.daemon.server.DaemonStateCoordinator$1.run(DaemonStateCoordinator.java:246)
    	at org.gradle.internal.concurrent.ExecutorPolicy$CatchAndRecordFailures.onExecute(ExecutorPolicy.java:54)
    	at org.gradle.internal.concurrent.StoppableExecutorImpl$1.run(StoppableExecutorImpl.java:40)
    Caused by: org.gradle.process.internal.ExecException: A problem occurred starting process 'command 'C:\Users\cb\.IdeaIC2019.3\config\jdks\jbsdk8u112b287_windows_x64\bin\java.exe''
    	at org.gradle.process.internal.DefaultExecHandle.setEndStateInfo(DefaultExecHandle.java:197)
    	at org.gradle.process.internal.DefaultExecHandle.failed(DefaultExecHandle.java:327)
    	at org.gradle.process.internal.ExecHandleRunner.run(ExecHandleRunner.java:86)
    	... 2 more
    Caused by: net.rubygrapefruit.platform.NativeException: Could not start 'C:\Users\cb\.IdeaIC2019.3\config\jdks\jbsdk8u112b287_windows_x64\bin\java.exe'
    	at net.rubygrapefruit.platform.internal.DefaultProcessLauncher.start(DefaultProcessLauncher.java:27)
    	at net.rubygrapefruit.platform.internal.WindowsProcessLauncher.start(WindowsProcessLauncher.java:22)
    	at net.rubygrapefruit.platform.internal.WrapperProcessLauncher.start(WrapperProcessLauncher.java:36)
    	at org.gradle.process.internal.ExecHandleRunner.run(ExecHandleRunner.java:68)
    	... 2 more
    Caused by: java.io.IOException: Cannot run program "C:\Users\cb\.IdeaIC2019.3\config\jdks\jbsdk8u112b287_windows_x64\bin\java.exe" (in directory "C:\Users\cb\Desktop\forge-1.8 - Test\run"): CreateProcess error=267, Der Verzeichnisname ist ung�ltig
    	at net.rubygrapefruit.platform.internal.DefaultProcessLauncher.start(DefaultProcessLauncher.java:25)
    	... 5 more
    Caused by: java.io.IOException: CreateProcess error=267, Der Verzeichnisname ist ung�ltig
    	... 6 more
    
    23:50:40: Task execution finished 'runClient --stacktrace'.

    package com.allstreamer.bettervanilla;
    
    import net.minecraft.init.Blocks;
    import net.minecraft.init.Items;
    import net.minecraft.item.Item;
    import net.minecraft.item.ItemStack;
    import net.minecraft.item.crafting.RecipesBanners;
    import net.minecraft.item.crafting.RecipesCrafting;
    import net.minecraftforge.fml.common.Mod;
    import net.minecraftforge.fml.common.Mod.EventHandler;
    import net.minecraftforge.fml.common.event.FMLInitializationEvent;
    import net.minecraftforge.fml.common.event.FMLPostInitializationEvent;
    import net.minecraftforge.fml.common.event.FMLPreInitializationEvent;
    import net.minecraftforge.fml.common.registry.GameRegistry;
    
    import java.rmi.registry.Registry;
    
    @Mod(modid = BetterVanilla.MODID, version = BetterVanilla.VERSION)
    public class BetterVanilla
    {
     public static final String MODID = "bettervanillaallstreamer";
     public static final String VERSION = "1.0";
    
     @EventHandler
     public void preinit(FMLPreInitializationEvent event){
     ItemStack Wool = new ItemStack(Blocks.wool,1);
     ItemStack String = new ItemStack(Items.string,1);
    
     GameRegistry.addShapelessRecipe(String,Wool);
     }
    
     @EventHandler
     public void init(FMLInitializationEvent event) {
    
     }
    
     @EventHandler
     public void postinit(FMLPostInitializationEvent event){
    
     }
    }
    
    Here is the error log:

    Posted in: Modification Development
  • To post a comment, please or register a new account.